NativeScript

Submit and vote on ideas for the NativeScript framework and NativeScript plugins

Security for the JS code

  • Thumb32 Valio Stoychev
  • Jun 1 2015
  • Shipped
Link to GitHub issue
  • Attach files
  • Valio Stoychev commented
    January 4, 2016 10:09

    Please check this NativeScript Protect product by Master Technology - http://fluentreports.com/blog/?p=159 which solves the security in NativeScript.

  • Christian Brousseau commented
    January 4, 2016 14:52

    @Valio, does that mean that the NativeScript-Protect product is officially sanctioned and supported by Telerik?

  • Valio Stoychev commented
    February 9, 2016 08:45

    @Christian Brousseau - No it is not verified by Telerik. I think this plugin should not be reviewed by us (the core {N} team), but by other third party developers. It is up to @Nathanael to work on this and ask for community help.

     

    We are working on a separate solution which is described in the GitHub issue above.

  • Valio Stoychev commented
    August 11, 2016 12:21

    The security plugin for NativeScript is already available. If you need it badly please contact me valio.stoychev@telerik.com

     

    It will be announced soon in public.

  • Sumeet Batheja commented
    September 17, 2016 10:11

    I need the plugin, I have already tried contacting you Valio.

  • Guest commented
    November 24, 2016 12:49

    The official plugin from the NAtiveScript team is now public - https://github.com/NativeScript/nativescript-app-encryption 

  • Priyanga Manivelan commented
    July 4, 2017 07:55

    This was my error(By using Nativescript-AppProtection)

    D:\Sample\platforms\android\src\main\java\com\tns\RuntimeHe
    lper.java:57: error: package com.tns.app_protection does not exist
    com.tns.app_protection.AppProtection.setKey("qyUMQZhu43KByppjVJFJyRxVG+PZaRAHId2
    +mczHiwo=");
    ^
    Note: Some input files use or override a deprecated API.
    Note: Recompile with -Xlint:deprecation for details.
    1 error
    :compileF0F1F2F3F4F5F6F7F8F9F10F11F12F13F14F15F16ReleaseJavaWithJavac FAILED

    FAILURE: Build failed with an exception.

    What went wrong:
    Execution failed for task ':compileF0F1F2F3F4F5F6F7F8F9F10F11F12F13F14F15F16Rele
    aseJavaWithJavac'.
    
    Compilation failed; see the compiler error output for details.
    
    Try:
    Run with --stacktrace option to get the stack trace. Run with --info or --debug
    option to get more log output.
    

    BUILD FAILED

  • Gravatar
  • Gravatar
  • Gravatar
  • Gravatar
  • Gravatar
  • Gravatar
  • Gravatar
  • Gravatar
  • Gravatar
  • Gravatar
  • Gravatar
  • Gravatar
  • Gravatar
  • Gravatar
  • Gravatar
  • Gravatar
  • Gravatar
  • Gravatar
  • Gravatar
  • Gravatar
  • Gravatar
  • Gravatar
  • Gravatar
  • Gravatar
  • Gravatar
  • Gravatar
  • Gravatar
  • Gravatar
  • Gravatar
  • Gravatar
  • Gravatar
  • Gravatar
  • Gravatar
  • Gravatar
  • Gravatar
  • Gravatar
  • Gravatar
  • Gravatar
  • Gravatar
  • Gravatar
  • Gravatar
  • Gravatar
  • Gravatar